Unexpected Syntax Error Unexpected Token

Thanks for contributing an answer to Stack Overflow! Please be sure to answer the question.Provide details and share your research! But avoid. Asking for.

Critical Theory Reading List Apr 4, 2019. This definition reminds us that theory, especially in art history, is not. Each of the 31 chapters in this book examines the history and use of a

I am running an AJAX call in my MooTools script, this works fine in Firefox but in Chrome I am getting a Uncaught SyntaxError: Unexpected token : error, I cannot determine why. Commenting out code to

php: No such file or directory httpdocs/auto_mailer.php: line 3: //: is a directory httpdocs/auto_mailer.php: line 5: syntax error near unexpected token `’include/config.inc.php” httpdocs/auto_mailer.

syntax error : ‘PCH creation point’ x:dtran5.pdschapter 14 testingtesting.cpp(6) : error C2238: unexpected token(s) preceding ‘;’ x:dtran5.pdschapter 14 testingtesting.cpp(8) : error C2059:.

I get the following errors on the line with "static const string.": error C2059: syntax error : ‘{‘ error C2334: unexpected token(s) preceding ‘{‘; skipping apparent function body when trying to.

"The solutions and answers provided on Experts Exchange have been extremely helpful to me over the last few years. I wear a lot of hats – Developer, Database Administrator, Help Desk, etc., so I know a lot of things but not a lot about one thing.

syntax error : missing ‘;’ before ‘<‘ (course.h)error C4430: missing type specifier – int assumed. Note: C++ does not support default-int (course.h)error C2238: unexpected token(s) preceding ‘;’.

Stack Exchange Network. Stack Exchange network consists of 175 Q&A communities including Stack Overflow, the largest, most trusted online community for developers to learn, share their knowledge, and build their careers. Visit Stack Exchange

I am so confuse as to why it is not working. I’ve change this thing back and forth and getting no where. It is driving me crazy. The error message keep saying script2: line 10: syntax error near.

#endif 1>e:c++ level 2address bookaddress bookaddressbook.h(17) : error C2143: syntax error : missing ‘;’ before. bookaddress bookaddressbook.h(17) : error C2238: unexpected token(s).

mysql-connector-java-5.1.12/mysql-connector-java-5.1.12-bin.jar: command substitution: line 3: syntax error near unexpected token `=F0Uû4ð:YÐ0ø¶Ë¶ý þ%ië’.

Unexpected token error you’re gonna get! — It doesn’t work. Why doesn’t it work? Well, simply because ‘if’s inside objects aren’t valid JS syntax. “Why is it putting everything in an object?!“ you.

(An ((Even Better) Lisp) Interpreter (in Python)) In a previous essay I showed how to write a simple Lisp interpreter in 90 lines of Python: lis.py.In this essay I make the implementation, lispy.py, three times more complicated, but more complete.Each section handles an addition. (1) New data types: string, boolean, complex, port Adding a new data type to Lispy has three parts: the internal.

syntax error : ‘<‘ 1>c:userspublicdocumentsaoc sourcec++aoe2wideaoe2wideAoE2Wide.h(35): error C2238: unexpected token(s) preceding ‘;’ #include <iostream> #include <string> #include <vector>.

string nextToken; while (inFile >> nextToken){ cout << "Token. storage-class or type specifier(s) unexpected here; ignored c:program filesmicrosoft visual studiovc98includeerrno.h(29) : error.

The following example shows how to use Bison and flex to write a simple calculator program (only addition and multiplication) and a program for creating an abstract syntax tree.The next two files provide definition and implementation of the syntax tree functions.

Error: Severity: Description: 10300: 16: Assembly ‘%.*ls’ references assembly ‘%.*ls’, which is not present in the current database. SQL Server attempted to locate and automatically load the referenced assembly from the same location where referring assembly came from, but that operation has fai

syntax error : missing ‘;’ before ‘.’ c:program filesmicrosoft sdkswindowsv7.0aincludewinnt.h 13112 Error 3 error C2238: unexpected token(s) preceding ‘;’ c:program filesmicrosoft sdkswindows.

Research Papers On Cryptography less then minute ago 1 by in Research paper on cryptography and network security solutions. Business plan for loans assignment foreign legion tv series. Examples of argument essays examples Examples

the compiler throws the following error message: The compiler returned an error. (1) : error C0000: syntax error, unexpected ‘.’, expecting "::" at token.

s23:line 3: if[!-z test]: command not found s23:line 4: if [-r test -a -w $fname -a -x test] : command not found s23:line 5:syntax error near unexpected token ‘then’ i have seen this program in a.

Free Willy 2 Whale No video file is hosted on Gostream, all the files are uploaded by non affiliated uploaders on file-sharing hosts. FREE MOVIES WATCH MOVIES ONLINE FREE FREE MOVIES ONLINE WATCH FULL

The error example. requires “Pos() token.Pos” and “End() token.Pos” which returns position of node. So, to represent sum type as interface, add common methods to the interface. It’s useful for.

Another tool which is good to have installed is an IDE (Integrated Development Environment) or any code editor with HTML and JavaScript syntax. cause unexpected behavior or even vulnerability. It’s.

Lets use the new default parameters syntax (which is not yet supported by many browsers. src/index.html When this is loaded within most browsers it will error “Unexpected token import”, as the.

Purdue Academic Calendar 2019 “We want to be clear that this campus will offer students the quality academic experience that is behind the Purdue name while, at the same time, stressing our community partnership

Dec 14, 2010  · XPath 2.0 is an expression language that allows the processing of values conforming to the data model defined in [XQuery 1.0 and XPath 2.0 Data Model (Second Edition)].The data model provides a tree representation of XML documents as well as atomic values such as integers, strings, and booleans, and sequences that may contain both references to nodes in an XML document and atomic.

unexpected token(s) preceding ‘;’ c:documents and settingscompaq_administratormy documentsvisual studio 2008projectssdl_tutorialsper pixel collisionper pixel collisiondot.h(14) : error C2061:.